Target
Matrilysin
Ligand
BDBM50072571
Substrate
Meas. Tech.
ChEBML_102124
IC50
13±n/a nM
Citation
 Sheppard, GSFlorjancic, ASGiesler, JRXu, LGuo, YDavidsen, SKMarcotte, PAElmore, IAlbert, DHMagoc, TJBouska, JJGoodfellow, CLMorgan, DWSummers, JB Aryl ketones as novel replacements for the C-terminal amide bond of succinyl hydroxamate MMP inhibitors. Bioorg Med Chem Lett 8:3251-6 (1999)  
Target
Name:
Matrilysin
Synonyms:
MMP7 MPSL1 Matrix metalloproteinase-7 (MMP-7) PUMP1
Type:
Enzyme
Mol. Mass.:
29681.54
Organism:
Homo sapiens (Human)
Description:
P09237
Residue:
267
  
Inhibitor
Name:
BDBM50072571
Synonyms:
(2R,3S)-2-Allyl-N*4*-((S)-1-benzyl-2-oxo-2-thiophen-2-yl-ethyl)-N*1*-hydroxy-3-isobutyl-succinamide | CHEMBL419011
Type:
Small organic molecule
Emp. Form.:
C24H30N2O4S
Mol. Mass.:
442.571
SMILES:
CC(C)C[C@H]([C@H](CC=C)C(=O)NO)C(=O)N[C@@H](Cc1ccccc1)C(=O)c1cccs1
: