Target
Stromelysin-1
Ligand
BDBM50072572
Substrate
Meas. Tech.
ChEBML_102122
IC50
3.4±n/a nM
Citation
 Sheppard, GSFlorjancic, ASGiesler, JRXu, LGuo, YDavidsen, SKMarcotte, PAElmore, IAlbert, DHMagoc, TJBouska, JJGoodfellow, CLMorgan, DWSummers, JB Aryl ketones as novel replacements for the C-terminal amide bond of succinyl hydroxamate MMP inhibitors. Bioorg Med Chem Lett 8:3251-6 (1999)  
Target
Name:
Stromelysin-1
Synonyms:
MMP-3 MMP3_HUMAN Matrix metalloproteinase 3 Matrix metalloproteinase-3 (MMP-3) SL-1 Stromelysin 1 | Transin-1
Type:
Enzyme
Mol. Mass.:
53973.13
Organism:
Homo sapiens (Human)
Description:
P08254
Residue:
477
  
Inhibitor
Name:
BDBM50072572
Synonyms:
(7S,8R,11S)-11-(4-Hydroxymethyl-benzoyl)-8-isobutyl-9-oxo-2-oxa-10-aza-bicyclo[11.2.2]heptadeca-1(16),13(17),14-triene-7-carboxylic acid hydroxyamide | CHEMBL325940
Type:
Small organic molecule
Emp. Form.:
C28H36N2O6
Mol. Mass.:
496.5952
SMILES:
CC(C)C[C@@H]1[C@H](CCCCOc2ccc(C[C@H](NC1=O)C(=O)c1ccc(CO)cc1)cc2)C(=O)NO
: