Target
72 kDa type IV collagenase
Ligand
BDBM50072573
Substrate
Meas. Tech.
ChEMBL_102120 (CHEMBL710597)
IC50
1100±n/a nM
Citation
 Sheppard, GSFlorjancic, ASGiesler, JRXu, LGuo, YDavidsen, SKMarcotte, PAElmore, IAlbert, DHMagoc, TJBouska, JJGoodfellow, CLMorgan, DWSummers, JB Aryl ketones as novel replacements for the C-terminal amide bond of succinyl hydroxamate MMP inhibitors. Bioorg Med Chem Lett 8:3251-6 (1999)  
Target
Name:
72 kDa type IV collagenase
Synonyms:
72 kDa gelatinase CLG4A Gelatinase A (MMP-2) MMP2_HUMAN Matrix metalloproteinase-2 (MMP 2) Matrix metalloproteinases 2 (MMP-2) | TBE-1
Type:
Enzyme
Mol. Mass.:
73870.36
Organism:
Homo sapiens (Human)
Description:
P08253
Residue:
660
  
Inhibitor
Name:
BDBM50072573
Synonyms:
(2R,3S)-2-Allyl-N*4*-((S)-1-benzyl-2-oxo-2-thiazol-2-yl-ethyl)-N*1*-hydroxy-3-isobutyl-succinamide | CHEMBL110153
Type:
Small organic molecule
Emp. Form.:
C23H29N3O4S
Mol. Mass.:
443.559
SMILES:
CC(C)C[C@H]([C@H](CC=C)C(=O)NO)C(=O)N[C@@H](Cc1ccccc1)C(=O)c1nccs1
: