Target
Tissue alpha-L-fucosidase
Ligand
BDBM50072585
Substrate
Meas. Tech.
ChEMBL_216282 (CHEMBL819888)
pH
6.5±n/a
Ki
6800±n/a nM
Comments
extracted
Citation
 Witczak, ZJBoryczewski, D Thio-sugars. IV: Design and synthesis of S-linked fucoside analogs as a new class of alpha-L-fucosidase inhibitors. Bioorg Med Chem Lett 8:3265-8 (1999)  
Target
Name:
Tissue alpha-L-fucosidase
Synonyms:
Alpha-L-fucosidase I FUCA1 Tissue alpha-L-fucosidase
Type:
PROTEIN
Mol. Mass.:
53690.69
Organism:
Homo sapiens (Human)
Description:
ChEMBL_34088
Residue:
466
  
Inhibitor
Name:
BDBM50072585
Synonyms:
2-Aminomethylsulfanyl-6-methyl-tetrahydro-pyran-3,4,5-triol | CHEMBL113433
Type:
Small organic molecule
Emp. Form.:
C7H15NO4S
Mol. Mass.:
209.263
SMILES:
CC1OC(SCN)C(O)C(O)C1O
: