Target
Melatonin receptor type 1B
Ligand
BDBM50072651
Substrate
Meas. Tech.
ChEBML_219514
Ki
0.530±n/a nM
Citation
 Kloubert, SMathé-Allainmat, MAndrieux, JSicsic, SLanglois, M Synthesis of benzocycloalkane derivatives as new conformationally restricted ligands for melatonin receptors. Bioorg Med Chem Lett 8:3325-30 (1999)  
Target
Name:
Melatonin receptor type 1B
Synonyms:
MEL-1B-R Melatonin Melatonin receptor type 1B
Type:
Enzyme Catalytic Domain
Mol. Mass.:
33012.73
Organism:
Chick
Description:
Melatonin 0 Chick::P51050
Residue:
289
  
Inhibitor
Name:
BDBM50072651
Synonyms:
CHEMBL113859 | N-(7-Methoxy-1,2,3,4-tetrahydro-naphthalen-1-ylmethyl)-propionamide
Type:
Small organic molecule
Emp. Form.:
C15H21NO2
Mol. Mass.:
247.3327
SMILES:
CCC(=O)NCC1CCCc2ccc(OC)cc12
: