Target
Tissue alpha-L-fucosidase
Ligand
BDBM50072684
Substrate
Meas. Tech.
ChEMBL_216163 (CHEMBL815334)
IC50
170±n/a nM
Citation
 Wischnat, RMartin, RTakayama, SWong, CH Chemoenzymatic synthesis of iminocyclitol derivatives: a useful library strategy for the development of selective fucosyltransfer enzymes inhibitors. Bioorg Med Chem Lett 8:3353-8 (1999)  
Target
Name:
Tissue alpha-L-fucosidase
Synonyms:
Alpha-L-fucosidase I FUCA1 Tissue alpha-L-fucosidase
Type:
PROTEIN
Mol. Mass.:
53690.69
Organism:
Homo sapiens (Human)
Description:
ChEMBL_34088
Residue:
466
  
Inhibitor
Name:
BDBM50072684
Synonyms:
2-Amino-N-(3,4,5-trihydroxy-2-hydroxymethyl-6-methyl-piperidin-2-ylmethyl)-acetamide | CHEMBL115828
Type:
Small organic molecule
Emp. Form.:
C10H21N3O5
Mol. Mass.:
263.2908
SMILES:
CC1NC(CO)(CNC(=O)CN)C(O)C(O)C1O
: