Target
Potassium voltage-gated channel subfamily H member 2
Ligand
BDBM50518519
Substrate
Meas. Tech.
ChEMBL_1871838 (CHEMBL4373005)
IC50
5.0±n/a nM
Citation
 Barberis, CPribish, JTserlin, EGross, ACzekaj, MBarragué, MErdman, PManiar, SJiang, JFire, LPatel, VHebert, ALevit, MWang, ASun, FHuang, SA Discovery of N-substituted 7-azaindoles as Pan-PIM kinases inhibitors - Lead optimization - Part III. Bioorg Med Chem Lett 29:491-495 (2019)  
Target
Name:
Potassium voltage-gated channel subfamily H member 2
Synonyms:
1,3-beta-glucan synthase component GLS2 ERG Eag-related protein 1 Ether-a-go-go-related gene (HERG) Ether-a-go-go-related gene potassium channel 1 Ether-a-go-go-related gene potassium channel 1 (hERG1) Ether-a-go-go-related protein 1 H-ERG KCNH2 Potassium voltage-gated channel subfamily H member 2 (hERG) Voltage-gated potassium channel subunit Kv11.1 hERG Potassium Channel 1 | putative potassium channel subunit
Type:
Multi-pass membrane protein
Mol. Mass.:
126672.65
Organism:
Homo sapiens (Human)
Description:
Q12809
Residue:
1159
  
Inhibitor
Name:
BDBM50518519
Synonyms:
CHEMBL4457389
Type:
Small organic molecule
Emp. Form.:
C20H22Cl2N4O2
Mol. Mass.:
421.32
SMILES:
CC1(CC#Cc2c(Cl)c3c(Cl)cc(nc3n2[C@H]2CCCNC2)C(N)=O)COC1
: