Target
Potassium voltage-gated channel subfamily H member 2
Ligand
BDBM50518512
Substrate
Meas. Tech.
ChEMBL_1871838 (CHEMBL4373005)
IC50
4.0±n/a nM
Citation
 Barberis, CPribish, JTserlin, EGross, ACzekaj, MBarragué, MErdman, PManiar, SJiang, JFire, LPatel, VHebert, ALevit, MWang, ASun, FHuang, SA Discovery of N-substituted 7-azaindoles as Pan-PIM kinases inhibitors - Lead optimization - Part III. Bioorg Med Chem Lett 29:491-495 (2019)  
Target
Name:
Potassium voltage-gated channel subfamily H member 2
Synonyms:
1,3-beta-glucan synthase component GLS2 ERG Eag-related protein 1 Ether-a-go-go-related gene (HERG) Ether-a-go-go-related gene potassium channel 1 Ether-a-go-go-related gene potassium channel 1 (hERG1) Ether-a-go-go-related protein 1 H-ERG KCNH2 Potassium voltage-gated channel subfamily H member 2 (hERG) Voltage-gated potassium channel subunit Kv11.1 hERG Potassium Channel 1 | putative potassium channel subunit
Type:
Multi-pass membrane protein
Mol. Mass.:
126672.65
Organism:
Homo sapiens (Human)
Description:
Q12809
Residue:
1159
  
Inhibitor
Name:
BDBM50518512
Synonyms:
CHEMBL4541837
Type:
Small organic molecule
Emp. Form.:
C20H24Cl2N4O2
Mol. Mass.:
423.336
SMILES:
COC(C)(C)CC#Cc1c(Cl)c2c(Cl)cc(nc2n1[C@H]1CCCNC1)C(N)=O
: