Target
5-hydroxytryptamine receptor 2A
Ligand
BDBM50072823
Substrate
Meas. Tech.
ChEMBL_2586 (CHEMBL617607)
IC50
2.1±n/a nM
Citation
 Bolós, JAnglada, LGubert, SPlanas, JMAgut, JPríncep, MDe la Fuente, NSacristán, AOrtiz, JA 7-[3-(1-piperidinyl)propoxy]chromenones as potential atypical antipsychotics. 2. Pharmacological profile of 7-[3-[4-(6-fluoro-1, 2-benzisoxazol-3-yl)-piperidin-1-yl]propoxy]-3-(hydroxymeth yl)chromen -4-one (abaperidone, FI-8602). J Med Chem 41:5402-9 (1999)  
Target
Name:
5-hydroxytryptamine receptor 2A
Synonyms:
5-HT-2A 5-HT2A 5-hydroxytryptamine receptor 2A (5HT2A) Htr2 Serotonin Receptor 2A
Type:
G Protein-Coupled Receptor (GPCR)
Mol. Mass.:
52852.05
Organism:
Rattus norvegicus (rat)
Description:
Rat cortex membranes 5-HT2A receptors.
Residue:
471
  
Inhibitor
Name:
BDBM50072823
Synonyms:
7-{3-[4-(6-Fluoro-benzo[d]isoxazol-3-yl)-piperidin-1-yl]-propoxy}-4-oxo-4H-chromene-3-carbaldehyde | CHEMBL149412
Type:
Small organic molecule
Emp. Form.:
C25H23FN2O5
Mol. Mass.:
450.4589
SMILES:
Fc1ccc2c(noc2c1)C1CCN(CCCOc2ccc3c(c2)occ(C=O)c3=O)CC1
: