Target
5-hydroxytryptamine receptor 2A
Ligand
BDBM50072822
Substrate
Meas. Tech.
ChEMBL_2586 (CHEMBL617607)
IC50
6.2±n/a nM
Citation
 Bolós, JAnglada, LGubert, SPlanas, JMAgut, JPríncep, MDe la Fuente, NSacristán, AOrtiz, JA 7-[3-(1-piperidinyl)propoxy]chromenones as potential atypical antipsychotics. 2. Pharmacological profile of 7-[3-[4-(6-fluoro-1, 2-benzisoxazol-3-yl)-piperidin-1-yl]propoxy]-3-(hydroxymeth yl)chromen -4-one (abaperidone, FI-8602). J Med Chem 41:5402-9 (1999)  
Target
Name:
5-hydroxytryptamine receptor 2A
Synonyms:
5-HT-2A 5-HT2A 5-hydroxytryptamine receptor 2A (5HT2A) Htr2 Serotonin Receptor 2A
Type:
G Protein-Coupled Receptor (GPCR)
Mol. Mass.:
52852.05
Organism:
Rattus norvegicus (rat)
Description:
Rat cortex membranes 5-HT2A receptors.
Residue:
471
  
Inhibitor
Name:
BDBM50072822
Synonyms:
7-{3-[4-(6-Fluoro-benzo[d]isoxazol-3-yl)-piperidin-1-yl]-propoxy}-3-hydroxymethyl-chromen-4-one | CHEMBL151475
Type:
Small organic molecule
Emp. Form.:
C25H25FN2O5
Mol. Mass.:
452.4748
SMILES:
OCc1coc2cc(OCCCN3CCC(CC3)c3noc4cc(F)ccc34)ccc2c1=O
: