Target
D(2) dopamine receptor
Ligand
BDBM50072825
Substrate
Meas. Tech.
ChEMBL_61443 (CHEMBL670669)
IC50
12.8±n/a nM
Citation
 Bolós, JAnglada, LGubert, SPlanas, JMAgut, JPríncep, MDe la Fuente, NSacristán, AOrtiz, JA 7-[3-(1-piperidinyl)propoxy]chromenones as potential atypical antipsychotics. 2. Pharmacological profile of 7-[3-[4-(6-fluoro-1, 2-benzisoxazol-3-yl)-piperidin-1-yl]propoxy]-3-(hydroxymeth yl)chromen -4-one (abaperidone, FI-8602). J Med Chem 41:5402-9 (1999)  
Target
Name:
D(2) dopamine receptor
Synonyms:
DOPAMINE D2 DOPAMINE D2 Short Dopamine D2 receptor Drd2
Type:
G Protein-Coupled Receptor (GPCR)
Mol. Mass.:
50931.60
Organism:
Rattus norvegicus (rat)
Description:
P61169
Residue:
444
  
Inhibitor
Name:
BDBM50072825
Synonyms:
7-{3-[4-(6-Fluoro-benzo[d]isoxazol-3-yl)-piperidin-1-yl]-propoxy}-4-oxo-4H-chromene-3-carboxylic acid | CHEMBL347997
Type:
Small organic molecule
Emp. Form.:
C25H23FN2O6
Mol. Mass.:
466.4583
SMILES:
OC(=O)c1coc2cc(OCCCN3CCC(CC3)c3noc4cc(F)ccc34)ccc2c1=O
: