Target
ATP-dependent Clp protease proteolytic subunit
Ligand
BDBM50518623
Substrate
Meas. Tech.
ChEMBL_1872034 (CHEMBL4373201)
IC50
14200±n/a nM
Citation
 Moreno-Cinos, CSassetti, ESalado, IGWitt, GBenramdane, SReinhardt, LCruz, CDJoossens, JVan der Veken, PBrötz-Oesterhelt, HTammela, PWinterhalter, MGribbon, PWindshügel, BAugustyns, K ?-Amino Diphenyl Phosphonates as Novel Inhibitors of Escherichia coli ClpP Protease. J Med Chem 62:774-797 (2019)  
Target
Name:
ATP-dependent Clp protease proteolytic subunit
Synonyms:
ATP-dependent Clp protease proteolytic subunit Caseinolytic protease Heat shock protein F21.5 Protease Ti lopP
Type:
PROTEIN
Mol. Mass.:
23183.39
Organism:
Escherichia coli (strain K12)
Description:
ChEMBL_109492
Residue:
207
  
Inhibitor
Name:
BDBM50518623
Synonyms:
CHEMBL4446383
Type:
Small organic molecule
Emp. Form.:
C29H25F3NO5P
Mol. Mass.:
555.4815
SMILES:
FC(F)(F)c1ccc(CC(NC(=O)OCc2ccccc2)P(=O)(Oc2ccccc2)Oc2ccccc2)cc1
: