Target
Coagulation factor X
Ligand
BDBM50072843
Substrate
Meas. Tech.
ChEMBL_48483 (CHEMBL662061)
Ki
13±n/a nM
Citation
 Renatus, MBode, WHuber, RStürzebecher, JStubbs, MT Structural and functional analyses of benzamidine-based inhibitors in complex with trypsin: implications for the inhibition of factor Xa, tPA, and urokinase. J Med Chem 41:5445-56 (1999)  
Target
Name:
Coagulation factor X
Synonyms:
Coagulation factor X FA10_BOVIN | Factor Xa (fXa)
Type:
PROTEIN
Mol. Mass.:
54498.45
Organism:
Bos taurus
Description:
ChEMBL_1364435
Residue:
492
  
Inhibitor
Name:
BDBM50072843
Synonyms:
2,7-Bis-(4-diaminomethyl-benzylidene)-cycloheptanone | CHEMBL357079
Type:
Small organic molecule
Emp. Form.:
C23H28N4O
Mol. Mass.:
376.4946
SMILES:
NC(N)c1ccc(\C=C2/CCCC\C(=C/c3ccc(cc3)C(N)N)C2=O)cc1
: