Target
Histone acetyltransferase KAT6B
Ligand
BDBM50518832
Substrate
Meas. Tech.
ChEMBL_1873651 (CHEMBL4374940)
IC50
28±n/a nM
Citation
 Leaver, DJCleary, BNguyen, NPriebbenow, DLLagiakos, HRSanchez, JXue, LHuang, FSun, YMujumdar, PMudududdla, RVarghese, STeguh, SCharman, SAWhite, KLKatneni, KCuellar, MStrasser, JMDahlin, JLWalters, MAStreet, IPMonahan, BJJarman, KESabroux, HJFalk, HChung, MCHermans, SJParker, MWThomas, TBaell, JB Discovery of Benzoylsulfonohydrazides as Potent Inhibitors of the Histone Acetyltransferase KAT6A. J Med Chem 62:7146-7159 (2019)  
Target
Name:
Histone acetyltransferase KAT6B
Synonyms:
2.3.1.48 Histone acetyltransferase MOZ2 KAT6B_HUMAN MORF MOZ2 MYST4 | Monocytic leukemia zinc finger protein-related factor
Type:
PROTEIN
Mol. Mass.:
231353.44
Organism:
Homo sapiens
Description:
ChEMBL_116754
Residue:
2073
  
Inhibitor
Name:
BDBM50518832
Synonyms:
CHEMBL4455897 | US10829446, Compound 36
Type:
Small organic molecule
Emp. Form.:
C20H17FN2O3S
Mol. Mass.:
384.424
SMILES:
Cc1cc(cc(C(=O)NNS(=O)(=O)c2ccccc2)c1F)-c1ccccc1
: