Target
Gag-Pol polyprotein [489-587]
Ligand
BDBM155
Substrate
Meas. Tech.
ChEMBL_157551 (CHEMBL763303)
Ki
0.024±n/a nM
Citation
 Debnath, AK Three-dimensional quantitative structure-activity relationship study on cyclic urea derivatives as HIV-1 protease inhibitors: application of comparative molecular field analysis. J Med Chem 42:249-59 (1999)  
Target
Name:
Gag-Pol polyprotein [489-587]
Synonyms:
Human immunodeficiency virus type 1 protease Pol polyprotein | gag-pol
Type:
Enzyme Subunit
Mol. Mass.:
10781.16
Organism:
Human immunodeficiency virus type 1
Description:
P04585[489-587]
Residue:
99
  
Inhibitor
Name:
BDBM155
Synonyms:
CHEMBL11266 SD146
Type:
Emp. Form.:
C49H44N8O5
Mol. Mass.:
824.9243
SMILES:
O[C@@H]1[C@@H](O)[C@@H](Cc2ccccc2)N(Cc2cccc(c2)C(=O)Nc2nc3ccccc3[nH]2)C(=O)N(Cc2cccc(c2)C(=O)Nc2nc3ccccc3[nH]2)[C@@H]1Cc1ccccc1
: