Target
Gag-Pol polyprotein [489-587]
Ligand
BDBM50073256
Substrate
Meas. Tech.
ChEBML_157700
Ki
0.850000±n/a nM
Citation
 Randad, RSLubkowska, LEissenstat, MAGulnik, SVYu, BBhat, TNClanton, DJHouse, TStinson, SFErickson, JW Unsymmetric nonpeptidic HIV protease inhibitors containing anthranilamide as a P2' ligand. Bioorg Med Chem Lett 8:3537-42 (1999)  
Target
Name:
Gag-Pol polyprotein [489-587]
Synonyms:
Human immunodeficiency virus type 1 protease Pol polyprotein | gag-pol
Type:
Enzyme Subunit
Mol. Mass.:
10781.16
Organism:
Human immunodeficiency virus type 1
Description:
P04585[489-587]
Residue:
99
  
Inhibitor
Name:
BDBM50073256
Synonyms:
CHEMBL122006 | [2-((1S,2S,4S)-1-Benzyl-4-tert-butoxycarbonylamino-2-hydroxy-5-phenyl-pentylcarbamoyl)-phenyl]-carbamic acid pyridin-2-ylmethyl ester
Type:
Small organic molecule
Emp. Form.:
C37H42N4O6
Mol. Mass.:
638.7526
SMILES:
CC(C)(C)OC(=O)N[C@H](C[C@H](O)[C@H](Cc1ccccc1)NC(=O)c1ccccc1NC(=O)OCc1ccccn1)Cc1ccccc1
: