Target
Kelch-like ECH-associated protein 1
Ligand
BDBM50498210
Substrate
Meas. Tech.
ChEMBL_1874778 (CHEMBL4376067)
Ki
540±n/a nM
Citation
 Tran, KTPallesen, JSSolbak, SMØNarayanan, DBaig, AZang, JAguayo-Orozco, ACarmona, RMCGarcia, ADBach, A A Comparative Assessment Study of Known Small-Molecule Keap1-Nrf2 Protein-Protein Interaction Inhibitors: Chemical Synthesis, Binding Properties, and Cellular Activity. J Med Chem 62:8028-8052 (2019)  
Target
Name:
Kelch-like ECH-associated protein 1
Synonyms:
Cytosolic inhibitor of Nrf2 KEAP1 KEAP1_HUMAN KLHL19 | Kelch-like protein 19
Type:
PROTEIN
Mol. Mass.:
69664.53
Organism:
Homo sapiens (Human)
Description:
ChEMBL_107924
Residue:
624
  
Inhibitor
Name:
BDBM50498210
Synonyms:
CHEMBL3423015
Type:
Small organic molecule
Emp. Form.:
C46H69N9O19
Mol. Mass.:
1052.089
SMILES:
CC(C)C[C@H](N)C(=O)N[C@@H](CC(O)=O)C(=O)N[C@@H](CCC(O)=O)C(=O)N[C@@H](CCC(O)=O)C(=O)N[C@@H]([C@@H](C)O)C(=O)NCC(=O)N[C@@H](CCC(O)=O)C(=O)N[C@@H](Cc1ccccc1)C(=O)N[C@@H](CC(C)C)C(O)=O
: