Target
Cysteinyl leukotriene receptor 1
Ligand
BDBM50073279
Substrate
Meas. Tech.
ChEBML_52385
Ki
4±n/a nM
Citation
 Chambers, RJAntognoli, GWCheng, JBKuperman, AVListon, TCMarfat, AOwens, BSPillar, JSShirley, JTWatson, JW Development of 2,2-dimethylchromanol cysteinyl LT1 receptor antagonists. Bioorg Med Chem Lett 8:3577-82 (1999)  
Target
Name:
Cysteinyl leukotriene receptor 1
Synonyms:
CLTR1_CAVPO | CYSLTR1
Type:
Enzyme Catalytic Domain
Mol. Mass.:
39007.58
Organism:
GUINEA PIG
Description:
Leukotriene D4 0 GUINEA PIG::Q2NNR5
Residue:
340
  
Inhibitor
Name:
BDBM50073279
Synonyms:
CHEMBL119214 | N-{3-[(3S,4R)-6-(7-Chloro-quinolin-2-ylmethoxy)-4-hydroxy-2,2-dimethyl-chroman-3-ylmethyl]-4-methoxy-phenyl}-C,C,C-trifluoro-methanesulfonamide
Type:
Small organic molecule
Emp. Form.:
C30H28ClF3N2O6S
Mol. Mass.:
637.066
SMILES:
COc1ccc(NS(=O)(=O)C(F)(F)F)cc1C[C@H]1[C@@H](O)c2cc(OCc3ccc4ccc(Cl)cc4n3)ccc2OC1(C)C
: