Target
Gag-Pol polyprotein [489-587]
Ligand
BDBM50073350
Substrate
Meas. Tech.
ChEBML_157537
Ki
20±n/a nM
Citation
 Baker, CTSalituro, FGCourt, JJDeininger, DDKim, EELi, BNovak, PMRao, BGPazhanisamy, SSchairer, WCTung, RD Design, synthesis, and conformational analysis of a novel series of HIV protease inhibitors. Bioorg Med Chem Lett 8:3631-6 (1999)  
Target
Name:
Gag-Pol polyprotein [489-587]
Synonyms:
Human immunodeficiency virus type 1 protease Pol polyprotein | gag-pol
Type:
Enzyme Subunit
Mol. Mass.:
10781.16
Organism:
Human immunodeficiency virus type 1
Description:
P04585[489-587]
Residue:
99
  
Inhibitor
Name:
BDBM50073350
Synonyms:
CHEMBL121146 | {(S)-3-[Cyclopentylmethyl-(4-methoxy-benzenesulfonyl)-amino]-2-hydroxy-propyl}-phenethyl-carbamic acid benzyl ester
Type:
Small organic molecule
Emp. Form.:
C32H40N2O6S
Mol. Mass.:
580.735
SMILES:
COc1ccc(cc1)S(=O)(=O)N(C[C@@H](O)CN(CCc1ccccc1)C(=O)OCc1ccccc1)CC1CCCC1
: