Target
Gag-Pol polyprotein [489-587]
Ligand
BDBM9235
Substrate
Meas. Tech.
ChEBML_157552
Ki
0.500000±n/a nM
Citation
 Salituro, FGBaker, CTCourt, JJDeininger, DDKim, EELi, BNovak, PMRao, BGPazhanisamy, SPorter, MDSchairer, WCTung, RD Design and synthesis of novel conformationally restricted HIV protease inhibitors. Bioorg Med Chem Lett 8:3637-42 (1999)  
Target
Name:
Gag-Pol polyprotein [489-587]
Synonyms:
Human immunodeficiency virus type 1 protease Pol polyprotein | gag-pol
Type:
Enzyme Subunit
Mol. Mass.:
10781.16
Organism:
Human immunodeficiency virus type 1
Description:
P04585[489-587]
Residue:
99
  
Inhibitor
Name:
BDBM9235
Synonyms:
(2S)-N-(cyclopentylmethyl)-3-[(3S,5R)-3,5-dibenzyl-2-oxopyrrolidin-1-yl]-2-hydroxy-N-(4-methoxyphenyl)propane-1-sulfonamido pyrrolidone 7
Type:
Small organic molecule
Emp. Form.:
C34H42N2O5S
Mol. Mass.:
590.773
SMILES:
COc1ccc(cc1)S(=O)(=O)N(C[C@@H](O)CN1[C@@H](Cc2ccccc2)C[C@H](Cc2ccccc2)C1=O)CC1CCCC1
: