Target
5-hydroxytryptamine receptor 2A
Ligand
BDBM50073444
Substrate
Meas. Tech.
ChEMBL_2583 (CHEMBL617604)
IC50
17±n/a nM
Citation
 Giannangeli, MCazzolla, NLuparini, MRMagnani, MMabilia, MPicconi, GTomaselli, MBaiocchi, L Effect of modifications of the alkylpiperazine moiety of trazodone on 5HT2A and alpha1 receptor binding affinity. J Med Chem 42:336-45 (1999)  
Target
Name:
5-hydroxytryptamine receptor 2A
Synonyms:
5-HT-2A 5-HT2A 5-hydroxytryptamine receptor 2A (5HT2A) Htr2 Serotonin Receptor 2A
Type:
G Protein-Coupled Receptor (GPCR)
Mol. Mass.:
52852.05
Organism:
Rattus norvegicus (rat)
Description:
Rat cortex membranes 5-HT2A receptors.
Residue:
471
  
Inhibitor
Name:
BDBM50073444
Synonyms:
2-{3-[4-(3-chlorophenyl)piperazin-1-yl]propyl}[1,2,4]triazolo[4,3-a]pyridin-3(2H)-one TRAZODONE
Type:
Small organic molecule
Emp. Form.:
C19H22ClN5O
Mol. Mass.:
371.864
SMILES:
Clc1cccc(c1)N1CCN(CCCn2nc3ccccn3c2=O)CC1
: