Target
D(2) dopamine receptor
Ligand
BDBM50073618
Substrate
Meas. Tech.
ChEMBL_61419 (CHEMBL675887)
IC50
870±n/a nM
Citation
 Perrone, RBerardi, FColabufo, NALeopoldo, MTortorella, V 1-aryl-4-[(5-methoxy-1,2,3, 4-tetrahydronaphthalen-1-yl)alkyl]piperazines and their analogues: influence of the stereochemistry of the tetrahydronaphthalen-1-yl nucleus on 5-HT1A receptor affinity and selectivity versus alpha1 and D2 receptors. 5. J Med Chem 42:490-6 (1999)  
Target
Name:
D(2) dopamine receptor
Synonyms:
DOPAMINE D2 DOPAMINE D2 Short Dopamine D2 receptor Drd2
Type:
G Protein-Coupled Receptor (GPCR)
Mol. Mass.:
50931.60
Organism:
Rattus norvegicus (rat)
Description:
P61169
Residue:
444
  
Inhibitor
Name:
BDBM50073618
Synonyms:
3-[4-(2-Methoxy-phenyl)-piperazin-1-yl]-N-((R)-5-methoxy-1,2,3,4-tetrahydro-naphthalen-1-yl)-propionamide | CHEMBL359245
Type:
Small organic molecule
Emp. Form.:
C25H33N3O3
Mol. Mass.:
423.5478
SMILES:
COc1cccc2[C@@H](CCCc12)NC(=O)CCN1CCN(CC1)c1ccccc1OC
: