Target
5-hydroxytryptamine receptor 1D
Ligand
BDBM50073686
Substrate
Meas. Tech.
ChEMBL_1728 (CHEMBL616933)
Ki
0.44±n/a nM
Citation
 Xu, YCSchaus, JMWalker, CKrushinski, JAdham, NZgombick, JMLiang, SXKohlman, DTAudia, JE N-Methyl-5-tert-butyltryptamine: A novel, highly potent 5-HT1D receptor agonist. J Med Chem 42:526-31 (1999)  
Target
Name:
5-hydroxytryptamine receptor 1D
Synonyms:
5-HT-1D 5-HT1D 5HT1D_HUMAN HTR1DA Serotonin (5-HT) receptor | Serotonin Receptor 1D
Type:
G Protein-Coupled Receptor (GPCR)
Mol. Mass.:
41920.63
Organism:
Homo sapiens (Human)
Description:
Receptor binding assays were performed using human clone stably expressed in CHO cells.
Residue:
377
  
Inhibitor
Name:
BDBM50073686
Synonyms:
CHEMBL423029 | [2-(5-tert-Butyl-1H-indol-3-yl)-ethyl]-dimethyl-amine
Type:
Small organic molecule
Emp. Form.:
C16H24N2
Mol. Mass.:
244.3752
SMILES:
CN(C)CCc1c[nH]c2ccc(cc12)C(C)(C)C
: