Target
5'-AMP-activated protein kinase catalytic subunit alpha-1
Ligand
BDBM50519662
Substrate
Meas. Tech.
ChEMBL_1877746 (CHEMBL4379140)
IC50
>10000±n/a nM
Citation
 Zhao, LLi, YWang, YQiao, ZMiao, ZYang, JHuang, LTian, CLi, LChen, DYang, S Discovery of 4 J Med Chem 62:10691-10710 (2019)  
Target
Name:
5'-AMP-activated protein kinase catalytic subunit alpha-1
Synonyms:
AAPK1_HUMAN AMP-activated protein kinase alpha-1/beta-2/gamma-2 AMPK subunit alpha-1 AMPK1 PRKAA1 | Tau-protein kinase PRKAA1
Type:
Protein
Mol. Mass.:
64023.62
Organism:
Homo sapiens (Human)
Description:
Q13131
Residue:
559
  
Inhibitor
Name:
BDBM50519662
Synonyms:
CHEMBL4438748
Type:
Small organic molecule
Emp. Form.:
C26H23N3O5
Mol. Mass.:
457.4779
SMILES:
CN(C)c1ccc(cc1)C(=O)Nc1cccc(NC(=O)COc2ccc3c(c2)occc3=O)c1
: