Target
Interstitial collagenase
Ligand
BDBM50073837
Substrate
Meas. Tech.
ChEBML_101745
IC50
200±n/a nM
Citation
 Reiter, LARizzi, JPPandit, JLasut, MJMcGahee, SMParikh, VDBlake, JFDanley, DELaird, ERLopez-Anaya, ALopresti-Morrow, LLMansour, MNMartinelli, GJMitchell, PGOwens, BSPauly, TAReeves, LMSchulte, GKYocum, SA Inhibition of MMP-1 and MMP-13 with phosphinic acids that exploit binding in the S2 pocket. Bioorg Med Chem Lett 9:127-32 (1999)  
Target
Name:
Interstitial collagenase
Synonyms:
CLG MMP1 Matrix metalloproteinase-1 | Matrix metalloproteinase-1 (MMP-1)
Type:
Enzyme
Mol. Mass.:
54010.26
Organism:
Homo sapiens (Human)
Description:
P03956
Residue:
469
  
Inhibitor
Name:
BDBM50073837
Synonyms:
(4-Benzyl-benzyl)-[3-cyclopropyl-2-((R)-2,2-dimethyl-1-methylcarbamoyl-propylcarbamoyl)-propyl]-phosphinic acid | CHEMBL26824
Type:
Small organic molecule
Emp. Form.:
C28H39N2O4P
Mol. Mass.:
498.594
SMILES:
CNC(=O)[C@H](NC(=O)C(CC1CC1)CP(O)(=O)Cc1ccc(Cc2ccccc2)cc1)C(C)(C)C
: