Target
Matrix metalloproteinase-9
Ligand
BDBM50073883
Substrate
Meas. Tech.
ChEMBL_105232 (CHEMBL712563)
IC50
49±n/a nM
Citation
 Fink, CACarlson, JEBoehm, CMcTaggart, PQiao, YDoughty, JGanu, VMelton, RGoldberg, R Design and synthesis of thiol containing inhibitors of matrix metalloproteinases. Bioorg Med Chem Lett 9:195-200 (1999)  
Target
Name:
Matrix metalloproteinase-9
Synonyms:
MMP9_RAT Matrix metalloproteinase-9 (MMP-9) | Mmp9
Type:
Mol. Mass.:
78603.01
Organism:
Rattus norvegicus (Rat)
Description:
P50282
Residue:
708
  
Inhibitor
Name:
BDBM50073883
Synonyms:
4-Ethoxy-1-mercaptomethyl-cyclohexanecarboxylic acid ((S)-2-phenyl-1-phenylcarbamoyl-ethyl)-amide | CHEMBL59496
Type:
Small organic molecule
Emp. Form.:
C25H32N2O3S
Mol. Mass.:
440.598
SMILES:
CCO[C@H]1CC[C@](CS)(CC1)C(=O)N[C@@H](Cc1ccccc1)C(=O)Nc1ccccc1
: