Target
Interstitial collagenase
Ligand
BDBM50073892
Substrate
Meas. Tech.
ChEBML_105960
IC50
700±n/a nM
Citation
 Fink, CACarlson, JEBoehm, CMcTaggart, PQiao, YDoughty, JGanu, VMelton, RGoldberg, R Design and synthesis of thiol containing inhibitors of matrix metalloproteinases. Bioorg Med Chem Lett 9:195-200 (1999)  
Target
Name:
Interstitial collagenase
Synonyms:
CLG MMP1 Matrix metalloproteinase-1 | Matrix metalloproteinase-1 (MMP-1)
Type:
Enzyme
Mol. Mass.:
54010.26
Organism:
Homo sapiens (Human)
Description:
P03956
Residue:
469
  
Inhibitor
Name:
BDBM50073892
Synonyms:
4-Ethoxy-1-mercaptomethyl-cyclohexanecarboxylic acid ((S)-1-methylcarbamoyl-2-phenyl-ethyl)-amide | CHEMBL61610
Type:
Small organic molecule
Emp. Form.:
C20H30N2O3S
Mol. Mass.:
378.529
SMILES:
CCO[C@H]1CC[C@](CS)(CC1)C(=O)N[C@@H](Cc1ccccc1)C(=O)NC
: