Target
Metalloproteinase inhibitor 3
Ligand
BDBM50073900
Substrate
Meas. Tech.
ChEBML_104705
IC50
77±n/a nM
Citation
 Fink, CACarlson, JEBoehm, CMcTaggart, PQiao, YDoughty, JGanu, VMelton, RGoldberg, R Design and synthesis of thiol containing inhibitors of matrix metalloproteinases. Bioorg Med Chem Lett 9:195-200 (1999)  
Target
Name:
Metalloproteinase inhibitor 3
Synonyms:
TIMP3_RAT Timp3 Tissue inhibitor of metalloproteinases-3
Type:
PROTEIN
Mol. Mass.:
24241.51
Organism:
Rattus norvegicus
Description:
ChEMBL_10750
Residue:
211
  
Inhibitor
Name:
BDBM50073900
Synonyms:
4-Ethoxy-1-mercaptomethyl-cyclohexanecarboxylic acid [(S)-1-(4-dimethylamino-phenylcarbamoyl)-2-phenyl-ethyl]-amide | CHEMBL299265
Type:
Small organic molecule
Emp. Form.:
C27H37N3O3S
Mol. Mass.:
483.666
SMILES:
CCO[C@H]1CC[C@](CS)(CC1)C(=O)N[C@@H](Cc1ccccc1)C(=O)Nc1ccc(cc1)N(C)C
: