Target
Matrix metalloproteinase-9
Ligand
BDBM50073902
Substrate
Meas. Tech.
ChEBML_105232
IC50
121±n/a nM
Citation
 Fink, CACarlson, JEBoehm, CMcTaggart, PQiao, YDoughty, JGanu, VMelton, RGoldberg, R Design and synthesis of thiol containing inhibitors of matrix metalloproteinases. Bioorg Med Chem Lett 9:195-200 (1999)  
Target
Name:
Matrix metalloproteinase-9
Synonyms:
MMP9_RAT Matrix metalloproteinase-9 (MMP-9) | Mmp9
Type:
Mol. Mass.:
78603.01
Organism:
Rattus norvegicus (Rat)
Description:
P50282
Residue:
708
  
Inhibitor
Name:
BDBM50073902
Synonyms:
4-Ethoxy-1-mercaptomethyl-cyclohexanecarboxylic acid [(S)-2-phenyl-1-(pyridin-2-ylcarbamoyl)-ethyl]-amide | CHEMBL417210
Type:
Small organic molecule
Emp. Form.:
C24H31N3O3S
Mol. Mass.:
441.586
SMILES:
CCO[C@H]1CC[C@](CS)(CC1)C(=O)N[C@@H](Cc1ccccc1)C(=O)Nc1ccccn1
: