Target
Matrix metalloproteinase-9
Ligand
BDBM50073897
Substrate
Meas. Tech.
ChEBML_105232
IC50
108±n/a nM
Citation
 Fink, CACarlson, JEBoehm, CMcTaggart, PQiao, YDoughty, JGanu, VMelton, RGoldberg, R Design and synthesis of thiol containing inhibitors of matrix metalloproteinases. Bioorg Med Chem Lett 9:195-200 (1999)  
Target
Name:
Matrix metalloproteinase-9
Synonyms:
MMP9_RAT Matrix metalloproteinase-9 (MMP-9) | Mmp9
Type:
Mol. Mass.:
78603.01
Organism:
Rattus norvegicus (Rat)
Description:
P50282
Residue:
708
  
Inhibitor
Name:
BDBM50073897
Synonyms:
1-Mercaptomethyl-4-trifluoromethyl-cyclohexanecarboxylic acid ((S)-1-methylcarbamoyl-2-phenyl-ethyl)-amide | CHEMBL293017
Type:
Small organic molecule
Emp. Form.:
C19H25F3N2O2S
Mol. Mass.:
402.474
SMILES:
CNC(=O)[C@H](Cc1ccccc1)NC(=O)[C@]1(CS)CC[C@@H](CC1)C(F)(F)F
: