Target
Integrin alpha-IIb/beta-3
Ligand
BDBM50074031
Substrate
Meas. Tech.
ChEMBL_70312 (CHEMBL678017)
Ki
19±n/a nM
Citation
 Keenan, RMCallahan, JFSamanen, JMBondinell, WECalvo, RRChen, LDeBrosse, CEggleston, DSHaltiwanger, RCHwang, SMJakas, DRKu, TWMiller, WHNewlander, KANichols, AParker, MFSouthhall, LSUzinskas, IVasko-Moser, JAVenslavsky, JWWong, ASHuffman, WF Conformational preferences in a benzodiazepine series of potent nonpeptide fibrinogen receptor antagonists. J Med Chem 42:545-59 (1999)  
Target
Name:
Integrin alpha-IIb/beta-3
Synonyms:
Glycoprotein IIb/IIIa
Type:
Mol. Mass.:
Description:
ASSAY_ID of EBI is 30109
Components:
This complex has 2 components.
Component 1
Name:
Integrin beta-3
Synonyms:
CD_antigen=CD61 GPIIIa ITGB3 Platelet membrane glycoprotein IIIa
Type:
Protein
Mol. Mass.:
87038.91
Organism:
Homo sapiens (Human)
Description:
P05106
Residue:
788
  
Component 2
Name:
Integrin alpha-IIb
Synonyms:
CD_antigen=CD41 GPIIb Glycoprotein IIb ITGA2B Integrin alpha-IIb heavy chain Integrin alpha-IIb light chain, form 2 Integrin alpha-V/beta-3 and alpha-IIb/beta 3 | Platelet membrane glycoprotein IIb
Type:
Protein
Mol. Mass.:
113354.85
Organism:
Homo sapiens (Human)
Description:
P08514
Residue:
1039
  
Inhibitor
Name:
BDBM50074031
Synonyms:
CHEMBL153802 | [3-Oxo-4-phenethyl-8-((E)-4-piperidin-4-yl-but-1-enyl)-2,3,4,5-tetrahydro-1H-benzo[e][1,4]diazepin-2-yl]-acetic acid
Type:
Small organic molecule
Emp. Form.:
C28H35N3O3
Mol. Mass.:
461.5958
SMILES:
OC(=O)CC1Nc2cc(\C=C\CCC3CCNCC3)ccc2CN(CCc2ccccc2)C1=O
: