Target
Histamine H3 receptor
Ligand
BDBM50074087
Substrate
Meas. Tech.
ChEMBL_86761 (CHEMBL698661)
Ki
20±n/a nM
Citation
 Sasse, AKiec-Kononowicz, KStark, HMotyl, MReidemeister, SGanellin, CRLigneau, XSchwartz, JCSchunack, W Development of chiral N-alkylcarbamates as new leads for potent and selective H3-receptor antagonists: synthesis, capillary electrophoresis, and in vitro and oral in vivo activity. J Med Chem 42:593-600 (1999)  
Target
Name:
Histamine H3 receptor
Synonyms:
HH3R Hrh3
Type:
G Protein-Coupled Receptor (GPCR)
Mol. Mass.:
48607.98
Organism:
Rattus norvegicus (rat)
Description:
Residue:
445
  
Inhibitor
Name:
BDBM50074087
Synonyms:
CHEMBL1076266 sec-Butyl-carbamic acid 3-(1H-imidazol-4-yl)-propyl ester; compound with (E)-but-2-enedioic acid
Type:
Small organic molecule
Emp. Form.:
C11H19N3O2
Mol. Mass.:
225.2875
SMILES:
CCC(C)NC(=O)OCCCc1cnc[nH]1
: