Target
5-hydroxytryptamine receptor 1D
Ligand
BDBM50074164
Substrate
Meas. Tech.
ChEMBL_1701 (CHEMBL616908)
IC50
0.45±n/a nM
Citation
 Sternfeld, FGuiblin, ARJelley, RAMatassa, VGReeve, AJHunt, PABeer, MSHeald, AStanton, JASohal, BWatt, APStreet, LJ Synthesis and serotonergic activity of 3-[2-(pyrrolidin-1-yl)ethyl]indoles: potent agonists for the h5-HT1D receptor with high selectivity over the h5-HT1B receptor. J Med Chem 42:677-90 (1999)  
Target
Name:
5-hydroxytryptamine receptor 1D
Synonyms:
5-HT-1D 5-HT1D 5HT1D_HUMAN HTR1DA Serotonin (5-HT) receptor | Serotonin Receptor 1D
Type:
G Protein-Coupled Receptor (GPCR)
Mol. Mass.:
41920.63
Organism:
Homo sapiens (Human)
Description:
Receptor binding assays were performed using human clone stably expressed in CHO cells.
Residue:
377
  
Inhibitor
Name:
BDBM50074164
Synonyms:
((S)-1-Phenyl-ethyl)-{(S)-1-[2-(5-[1,2,4]triazol-4-yl-1H-indol-3-yl)-ethyl]-pyrrolidin-3-ylmethyl}-amine | CHEMBL159759
Type:
Small organic molecule
Emp. Form.:
C25H30N6
Mol. Mass.:
414.5459
SMILES:
C[C@H](NC[C@@H]1CCN(CCc2c[nH]c3ccc(cc23)-n2cnnc2)C1)c1ccccc1
: