Target
5-hydroxytryptamine receptor 1B
Ligand
BDBM50074187
Substrate
Meas. Tech.
ChEMBL_1617 (CHEMBL616642)
IC50
59±n/a nM
Citation
 Chambers, MSStreet, LJGoodacre, SHobbs, SCHunt, PJelley, RAMatassa, VGReeve, AJSternfeld, FBeer, MSStanton, JARathbone, DWatt, APMacLeod, AM 3-(Piperazinylpropyl)indoles: selective, orally bioavailable h5-HT1D receptor agonists as potential antimigraine agents. J Med Chem 42:691-705 (1999)  
Target
Name:
5-hydroxytryptamine receptor 1B
Synonyms:
5-HT-1B 5-HT1B 5HT1B_HUMAN HTR1DB Serotonin (5-HT) receptor Serotonin Receptor 1B
Type:
G Protein-Coupled Receptor (GPCR)
Mol. Mass.:
43579.17
Organism:
Homo sapiens (Human)
Description:
Receptor binding assays were performed using human clone stably expressed in CHO cells
Residue:
390
  
Inhibitor
Name:
BDBM50074187
Synonyms:
3-{3-[4-(4-Chloro-benzyl)-piperazin-1-yl]-propyl}-5-[1,2,4]triazol-4-yl-1H-indole | CHEMBL161696
Type:
Small organic molecule
Emp. Form.:
C24H27ClN6
Mol. Mass.:
434.964
SMILES:
Clc1ccc(CN2CCN(CCCc3c[nH]c4ccc(cc34)-n3cnnc3)CC2)cc1
: