Target
5-hydroxytryptamine receptor 1D
Ligand
BDBM50060435
Substrate
Meas. Tech.
ChEMBL_1704 (CHEMBL616911)
IC50
33±n/a nM
Citation
 Chambers, MSStreet, LJGoodacre, SHobbs, SCHunt, PJelley, RAMatassa, VGReeve, AJSternfeld, FBeer, MSStanton, JARathbone, DWatt, APMacLeod, AM 3-(Piperazinylpropyl)indoles: selective, orally bioavailable h5-HT1D receptor agonists as potential antimigraine agents. J Med Chem 42:691-705 (1999)  
Target
Name:
5-hydroxytryptamine receptor 1D
Synonyms:
5-HT-1D 5-HT1D 5HT1D_HUMAN HTR1DA Serotonin (5-HT) receptor | Serotonin Receptor 1D
Type:
G Protein-Coupled Receptor (GPCR)
Mol. Mass.:
41920.63
Organism:
Homo sapiens (Human)
Description:
Receptor binding assays were performed using human clone stably expressed in CHO cells.
Residue:
377
  
Inhibitor
Name:
BDBM50060435
Synonyms:
3-[3-(4-Methyl-piperazin-1-yl)-propyl]-5-[1,2,4]triazol-4-yl-1H-indole | CHEMBL117249
Type:
Small organic molecule
Emp. Form.:
C18H24N6
Mol. Mass.:
324.4234
SMILES:
CN1CCN(CCCc2c[nH]c3ccc(cc23)-n2cnnc2)CC1
: