Target
Tyrosine-protein kinase Lck
Ligand
BDBM50074252
Substrate
Meas. Tech.
ChEMBL_221516 (CHEMBL841499)
Kd
9000±n/a nM
Citation
 Llinas-Brunet, MBeaulieu, PLCameron, DRFerland, JMGauthier, JGhiro, EGillard, JGorys, VPoirier, MRancourt, JWernic, DBetageri, RCardozo, MJakes, SLukas, SPatel, UProudfoot, JMoss, N Phosphotyrosine-containing dipeptides as high-affinity ligands for the p56lck SH2 domain. J Med Chem 42:722-9 (1999)  
Target
Name:
Tyrosine-protein kinase Lck
Synonyms:
2.7.10.2 LCK_HUMAN Leukocyte C-terminal Src kinase Lymphocyte-specific protein tyrosine kinase Protein YT16 Proto-oncogene tyrosine-protein kinase LCK T cell-specific protein-tyrosine kinase
Type:
Mol. Mass.:
57987.83
Organism:
Homo sapiens (Human)
Description:
P06239
Residue:
509
  
Inhibitor
Name:
BDBM50074252
Synonyms:
CHEMBL435654 | Phosphoric acid mono-(4-{(S)-2-acetylamino-2-[(S)-1-(3-methoxy-benzylcarbamoyl)-3-methyl-butylcarbamoyl]-ethyl}-phenyl) ester
Type:
Small organic molecule
Emp. Form.:
C25H34N3O8P
Mol. Mass.:
535.5265
SMILES:
COc1cccc(CNC(=O)[C@H](CC(C)C)NC(=O)[C@H](Cc2ccc(OP(O)(O)=O)cc2)NC(C)=O)c1
: