Target
Tyrosine-protein kinase Lck
Ligand
BDBM50074259
Substrate
Meas. Tech.
ChEMBL_221516 (CHEMBL841499)
Kd
16000±n/a nM
Citation
 Llinas-Brunet, MBeaulieu, PLCameron, DRFerland, JMGauthier, JGhiro, EGillard, JGorys, VPoirier, MRancourt, JWernic, DBetageri, RCardozo, MJakes, SLukas, SPatel, UProudfoot, JMoss, N Phosphotyrosine-containing dipeptides as high-affinity ligands for the p56lck SH2 domain. J Med Chem 42:722-9 (1999)  
Target
Name:
Tyrosine-protein kinase Lck
Synonyms:
2.7.10.2 LCK_HUMAN Leukocyte C-terminal Src kinase Lymphocyte-specific protein tyrosine kinase Protein YT16 Proto-oncogene tyrosine-protein kinase LCK T cell-specific protein-tyrosine kinase
Type:
Mol. Mass.:
57987.83
Organism:
Homo sapiens (Human)
Description:
P06239
Residue:
509
  
Inhibitor
Name:
BDBM50074259
Synonyms:
CHEMBL162104 | Phosphoric acid mono-{4-[(S)-2-acetylamino-2-((S)-1-benzylcarbamoyl-3-methyl-butylcarbamoyl)-ethyl]-phenyl} ester
Type:
Small organic molecule
Emp. Form.:
C24H32N3O7P
Mol. Mass.:
505.5005
SMILES:
CC(C)C[C@H](NC(=O)[C@H](Cc1ccc(OP(O)(O)=O)cc1)NC(C)=O)C(=O)NCc1ccccc1
: