Target
Retinoic acid receptor RXR-beta
Ligand
BDBM50074304
Substrate
Meas. Tech.
ChEMBL_197076 (CHEMBL806664)
EC50
32±n/a nM
Citation
 Canan Koch, SSDardashti, LJCesario, RMCroston, GEBoehm, MFHeyman, RANadzan, AM Synthesis of retinoid X receptor-specific ligands that are potent inducers of adipogenesis in 3T3-L1 cells. J Med Chem 42:742-50 (1999)  
Target
Name:
Retinoic acid receptor RXR-beta
Synonyms:
NR2B2 RXRB Retinoic acid receptor RXR-beta Retinoid receptor
Type:
PROTEIN
Mol. Mass.:
56932.89
Organism:
Homo sapiens (Human)
Description:
ChEMBL_39045
Residue:
533
  
Inhibitor
Name:
BDBM50074304
Synonyms:
4-{(3-Bromo-5,5,8,8-tetramethyl-5,6,7,8-tetrahydro-naphthalen-2-yl)-[(E)-hydroxyimino]-methyl}-benzoic acid | CHEMBL348797
Type:
Small organic molecule
Emp. Form.:
C22H24BrNO3
Mol. Mass.:
430.335
SMILES:
CC1(C)CCC(C)(C)c2cc(C(N=O)c3ccc(cc3)C(O)=O)c(Br)cc12
: