Target
Retinoic acid receptor RXR-gamma
Ligand
BDBM50032667
Substrate
Meas. Tech.
ChEMBL_197235 (CHEMBL801381)
EC50
246±n/a nM
Citation
 Canan Koch, SSDardashti, LJCesario, RMCroston, GEBoehm, MFHeyman, RANadzan, AM Synthesis of retinoid X receptor-specific ligands that are potent inducers of adipogenesis in 3T3-L1 cells. J Med Chem 42:742-50 (1999)  
Target
Name:
Retinoic acid receptor RXR-gamma
Synonyms:
NR2B3 RXRG Retinoic acid receptor RXR-gamma Retinoid X receptor gamma/retinoic acid receptor alpha
Type:
PROTEIN
Mol. Mass.:
50878.26
Organism:
Homo sapiens (Human)
Description:
ChEMBL_197216
Residue:
463
  
Inhibitor
Name:
BDBM50032667
Synonyms:
4-(3,5,5,8,8-Pentamethyl-5,6,7,8-tetrahydro-naphthalene-2-carbonyl)-benzoic acid CHEMBL98172
Type:
Small organic molecule
Emp. Form.:
C23H26O3
Mol. Mass.:
350.4507
SMILES:
Cc1cc2c(cc1C(=O)c1ccc(cc1)C(O)=O)C(C)(C)CCC2(C)C
: