Target
Integrin alpha-IIb/beta-3
Ligand
BDBM50074668
Substrate
Meas. Tech.
ChEMBL_215973 (CHEMBL821002)
IC50
>100000±n/a nM
Citation
 Lin, KAteeq, HSHsiung, SHChong, LTZimmerman, CNCastro, ALee, WCHammond, CEKalkunte, SChen, LLPepinsky, RBLeone, DRSprague, AGAbraham, WMGill, ALobb, RRAdams, SP Selective, tight-binding inhibitors of integrin alpha4beta1 that inhibit allergic airway responses. J Med Chem 42:920-34 (1999)  
Target
Name:
Integrin alpha-IIb/beta-3
Synonyms:
Glycoprotein IIb/IIIa
Type:
Mol. Mass.:
Description:
ASSAY_ID of EBI is 30109
Components:
This complex has 2 components.
Component 1
Name:
Integrin beta-3
Synonyms:
CD_antigen=CD61 GPIIIa ITGB3 Platelet membrane glycoprotein IIIa
Type:
Protein
Mol. Mass.:
87038.91
Organism:
Homo sapiens (Human)
Description:
P05106
Residue:
788
  
Component 2
Name:
Integrin alpha-IIb
Synonyms:
CD_antigen=CD41 GPIIb Glycoprotein IIb ITGA2B Integrin alpha-IIb heavy chain Integrin alpha-IIb light chain, form 2 Integrin alpha-V/beta-3 and alpha-IIb/beta 3 | Platelet membrane glycoprotein IIb
Type:
Protein
Mol. Mass.:
113354.85
Organism:
Homo sapiens (Human)
Description:
P08514
Residue:
1039
  
Inhibitor
Name:
BDBM50074668
Synonyms:
(S)-2-((S)-4-Methyl-2-{2-[4-(3-o-tolyl-ureido)-phenyl]-acetylamino}-pentanoylamino)-succinic acid | CHEMBL173552
Type:
Small organic molecule
Emp. Form.:
C26H32N4O7
Mol. Mass.:
512.5549
SMILES:
CC(C)C[C@H](NC(=O)Cc1ccc(NC(=O)Nc2ccccc2C)cc1)C(=O)N[C@@H](CC(O)=O)C(O)=O
: