Target
Epidermal growth factor receptor
Ligand
BDBM50074744
Substrate
Meas. Tech.
ChEMBL_103915 (CHEMBL711650)
IC50
11400±n/a nM
Citation
 Traxler, PGreen, JMett, HSéquin, UFuret, P Use of a pharmacophore model for the design of EGFR tyrosine kinase inhibitors: isoflavones and 3-phenyl-4(1H)-quinolones. J Med Chem 42:1018-26 (1999)  
Target
Name:
Epidermal growth factor receptor
Synonyms:
EGFR_MOUSE Epidermal growth factor receptor erbB1
Type:
PROTEIN
Mol. Mass.:
134859.02
Organism:
Mus musculus
Description:
ChEMBL_305656
Residue:
1210
  
Inhibitor
Name:
BDBM50074744
Synonyms:
3-(3-Chloro-phenyl)-5-hydroxy-7-methoxy-1H-quinolin-4-one | CHEMBL440453
Type:
Small organic molecule
Emp. Form.:
C16H12ClNO3
Mol. Mass.:
301.724
SMILES:
COc1cc(O)c2c(O)c(cnc2c1)-c1cccc(Cl)c1
: