Target
Metabotropic glutamate receptor 5
Ligand
BDBM50056272
Substrate
Meas. Tech.
ChEMBL_219028 (CHEMBL818796)
EC50
>100000±n/a nM
Citation
 Monn, JAValli, MJMassey, SMHansen, MMKress, TJWepsiec, JPHarkness, ARGrutsch, JLWright, RAJohnson, BGAndis, SLKingston, ATomlinson, RLewis, RGriffey, KRTizzano, JPSchoepp, DD Synthesis, pharmacological characterization, and molecular modeling of heterobicyclic amino acids related to (+)-2-aminobicyclo[3.1.0] hexane-2,6-dicarboxylic acid (LY354740): identification of two new potent, selective, and systemically active agonists for group II metabotropic glutamate receptors J Med Chem 42:1027-40 (1999)  
Target
Name:
Metabotropic glutamate receptor 5
Synonyms:
GPRC1E GRM5_HUMAN metabotropic glutamate 5 | metabotropic glutamate 5a
Type:
Enzyme
Mol. Mass.:
132484.72
Organism:
Homo sapiens (Human)
Description:
Residue:
1212
  
Inhibitor
Name:
BDBM50056272
Synonyms:
(1S,2S,5R,6S)-2-Amino-bicyclo[3.1.0]hexane-2,6-dicarboxylic acid (2S,6S)-2-Amino-bicyclo[3.1.0]hexane-2,6-dicarboxylic acid 2-Amino-bicyclo[3.1.0]hexane-2,6-dicarboxylic acid (LY 354740) CHEMBL8759 LY366563
Type:
Small organic molecule
Emp. Form.:
C8H11NO4
Mol. Mass.:
185.1772
SMILES:
N[C@]1(CC[C@H]2[C@@H]([C@@H]12)C(O)=O)C(O)=O
: