Target
UDP-3-O-acyl-N-acetylglucosamine deacetylase
Ligand
BDBM50074961
Substrate
Meas. Tech.
ChEBML_212262
IC50
1700±n/a nM
Citation
 Chen, MHSteiner, MGde Laszlo, SEPatchett, AAAnderson, MSHyland, SAOnishi, HRSilver, LLRaetz, CR Carbohydroxamido-oxazolidines: antibacterial agents that target lipid A biosynthesis. Bioorg Med Chem Lett 9:313-8 (1999)  
Target
Name:
UDP-3-O-acyl-N-acetylglucosamine deacetylase
Synonyms:
LPXC_ECOLI UDP-3-O-[3-hydroxymyristoyl] N-acetylglucosamine deacetylase (LxpC) asmB lpxC
Type:
Enzyme
Mol. Mass.:
33952.00
Organism:
Escherichia coli
Description:
P0A725
Residue:
305
  
Inhibitor
Name:
BDBM50074961
Synonyms:
2-p-Tolyl-4,5-dihydro-oxazole-4-carboxylic acid hydroxyamide | CHEMBL321062
Type:
Small organic molecule
Emp. Form.:
C11H12N2O3
Mol. Mass.:
220.2246
SMILES:
Cc1ccc(cc1)C1=NC(CO1)C(=O)NO
: