Target
B2 bradykinin receptor
Ligand
BDBM50074990
Substrate
Meas. Tech.
ChEMBL_216335 (CHEMBL818749)
Ki
2.9±n/a nM
Citation
 Heitsch, HWagner, ASchölkens, BAWirth, K Novel series of O-substituted 8-quinolines and 4-benzothiazoles as potent antagonists of the bradykinin B2 receptors. Bioorg Med Chem Lett 9:327-32 (1999)  
Target
Name:
B2 bradykinin receptor
Synonyms:
B2 bradykinin receptor BDKRB2 BKRB2_CAVPO | Bradykinin B2 receptor
Type:
Mol. Mass.:
42217.03
Organism:
Cavia porcellus
Description:
Residue:
372
  
Inhibitor
Name:
BDBM50074990
Synonyms:
4-[3-({[4-Chloro-2-cyano-3-(2-methyl-quinolin-8-yloxymethyl)-phenyl]-methyl-carbamoyl}-methyl)-ureido]-butyric acid | CHEMBL324950
Type:
Small organic molecule
Emp. Form.:
C26H26ClN5O5
Mol. Mass.:
523.968
SMILES:
CN(C(=O)CNC(=O)NCCCC(O)=O)c1ccc(Cl)c(COc2cccc3ccc(C)nc23)c1C#N
: