Target
Epidermal growth factor receptor
Ligand
BDBM50520591
Substrate
Meas. Tech.
ChEMBL_1880808 (CHEMBL4382307)
EC50
19±n/a nM
Citation
 Jang, JSon, JBTo, CBahcall, MKim, SYKang, SYMushajiang, MLee, YJänne, PAChoi, HGGray, NS Discovery of a potent dual ALK and EGFR T790M inhibitor. Eur J Med Chem 136:497-510 (2017)  
Target
Name:
Epidermal growth factor receptor
Synonyms:
EGF Receptor Substrate EGFR_HUMAN ERBB1 Epidermal Growth Factor Receptor erbB-1 Epidermal growth factor receptor (EGFR) HER1 Proto-oncogene c-ErbB-1 Tyrosine-Protein Kinase ErbB-1
Type:
Receptor Kinase Domain
Mol. Mass.:
134279.59
Organism:
Homo sapiens (Human)
Description:
P00533
Residue:
1210
  
Inhibitor
Name:
BDBM50520591
Synonyms:
CHEMBL4467561
Type:
Small organic molecule
Emp. Form.:
C27H35IN8O4S
Mol. Mass.:
694.587
SMILES:
COc1cc(N(C)CCN(C)C)c(NC(=O)C=C)cc1Nc1ncc(I)c(Nc2ccccc2S(=O)(=O)N(C)C)n1
: