Target
Alanine--tRNA ligase, cytoplasmic
Ligand
BDBM50075060
Substrate
Meas. Tech.
ChEBML_30528
IC50
>100000±n/a nM
Citation
 Yu, XYHill, JMYu, GWang, WKluge, AFWendler, PGallant, P Synthesis and structure-activity relationships of a series of novel thiazoles as inhibitors of aminoacyl-tRNA synthetases. Bioorg Med Chem Lett 9:375-80 (1999)  
Target
Name:
Alanine--tRNA ligase, cytoplasmic
Synonyms:
AARS AlaRS Alanyl-tRNA synthetase Renal carcinoma antigen NY-REN-42 | SYAC_HUMAN
Type:
PROTEIN
Mol. Mass.:
106792.58
Organism:
Homo sapiens (Human)
Description:
ChEMBL_30528
Residue:
968
  
Inhibitor
Name:
BDBM50075060
Synonyms:
((S)-2-Amino-3-phenyl-propionyl)-sulfamic acid (2R,3S,4R,5R)-3,4-dihydroxy-5-(4-phenyl-thiazol-2-yl)-tetrahydro-furan-2-ylmethyl ester | CHEMBL127892
Type:
Small organic molecule
Emp. Form.:
C23H25N3O7S2
Mol. Mass.:
519.591
SMILES:
N[C@@H](Cc1ccccc1)C(=O)NS(=O)(=O)OC[C@H]1O[C@H]([C@H](O)[C@@H]1O)c1nc(cs1)-c1ccccc1
: