Target
Isoleucine--tRNA ligase, cytoplasmic
Ligand
BDBM50075058
Substrate
Meas. Tech.
ChEMBL_88804 (CHEMBL696841)
IC50
15±n/a nM
Citation
 Yu, XYHill, JMYu, GWang, WKluge, AFWendler, PGallant, P Synthesis and structure-activity relationships of a series of novel thiazoles as inhibitors of aminoacyl-tRNA synthetases. Bioorg Med Chem Lett 9:375-80 (1999)  
Target
Name:
Isoleucine--tRNA ligase, cytoplasmic
Synonyms:
IARS Isoleucyl-tRNA synthetase | SYIC_HUMAN
Type:
PROTEIN
Mol. Mass.:
144489.34
Organism:
Homo sapiens (Human)
Description:
ChEMBL_88804
Residue:
1262
  
Inhibitor
Name:
BDBM50075058
Synonyms:
((S)-2-Amino-3-methyl-pentanoyl)-sulfamic acid (2R,3S,4R,5R)-3,4-dihydroxy-5-[4-(3-methoxy-phenyl)-thiazol-2-yl]-tetrahydro-furan-2-ylmethyl ester | CHEMBL125075
Type:
Small organic molecule
Emp. Form.:
C21H29N3O8S2
Mol. Mass.:
515.6
SMILES:
CCC(C)[C@H](N)C(=O)NS(=O)(=O)OC[C@H]1O[C@H]([C@H](O)[C@@H]1O)c1nc(cs1)-c1cccc(OC)c1
: