Target
Capsid scaffolding protein
Ligand
BDBM50075143
Substrate
Meas. Tech.
ChEBML_43071
IC50
380±n/a nM
Citation
 Jarvest, RLPinto, ILAshman, SMDabrowski, CEFernandez, AVJennings, LJLavery, PTew, DG Inhibition of herpes proteases and antiviral activity of 2-substituted thieno[2,3-d]oxazinones. Bioorg Med Chem Lett 9:443-8 (1999)  
Target
Name:
Capsid scaffolding protein
Synonyms:
Human herpesvirus 4 protease/capsid scaffold protein | SCAF_EBVB9
Type:
PROTEIN
Mol. Mass.:
64105.26
Organism:
Epstein-Barr virus (strain B95-8) (HHV-4) (Human herpesvirus 4)
Description:
ChEMBL_43071
Residue:
605
  
Inhibitor
Name:
BDBM50075143
Synonyms:
(E)-3-(2-Chloro-phenyl)-N-[(S)-1-(5-methyl-4-oxo-4H-thieno[2,3-d][1,3]oxazin-2-yl)-ethyl]-acrylamide | CHEMBL137860
Type:
Small organic molecule
Emp. Form.:
C18H15ClN2O3S
Mol. Mass.:
374.841
SMILES:
C[C@H](NC(=O)\C=C\c1ccccc1Cl)c1nc2scc(C)c2c(=O)o1
: