Target
Capsid scaffolding protein
Ligand
BDBM50075153
Substrate
Meas. Tech.
ChEBML_82457
IC50
530±n/a nM
Citation
 Jarvest, RLPinto, ILAshman, SMDabrowski, CEFernandez, AVJennings, LJLavery, PTew, DG Inhibition of herpes proteases and antiviral activity of 2-substituted thieno[2,3-d]oxazinones. Bioorg Med Chem Lett 9:443-8 (1999)  
Target
Name:
Capsid scaffolding protein
Synonyms:
Human herpesvirus 2 protease UL26
Type:
PROTEIN
Mol. Mass.:
66947.39
Organism:
Human herpesvirus 2 (strain HG52) (HHV-2) (Human herpes simplex virus2)
Description:
ChEMBL_82452
Residue:
637
  
Inhibitor
Name:
BDBM50075153
Synonyms:
(E)-3-(4-Formyl-phenyl)-N-[(S)-1-(5-methyl-4-oxo-4H-thieno[2,3-d][1,3]oxazin-2-yl)-ethyl]-acrylamide | CHEMBL336660
Type:
Small organic molecule
Emp. Form.:
C19H16N2O4S
Mol. Mass.:
368.406
SMILES:
C[C@H](NC(=O)\C=C\c1ccc(C=O)cc1)c1nc2scc(C)c2c(=O)o1
: