Target
Capsid scaffolding protein
Ligand
BDBM50075148
Substrate
Meas. Tech.
ChEBML_43071
IC50
220±n/a nM
Citation
 Jarvest, RLPinto, ILAshman, SMDabrowski, CEFernandez, AVJennings, LJLavery, PTew, DG Inhibition of herpes proteases and antiviral activity of 2-substituted thieno[2,3-d]oxazinones. Bioorg Med Chem Lett 9:443-8 (1999)  
Target
Name:
Capsid scaffolding protein
Synonyms:
Human herpesvirus 4 protease/capsid scaffold protein | SCAF_EBVB9
Type:
PROTEIN
Mol. Mass.:
64105.26
Organism:
Epstein-Barr virus (strain B95-8) (HHV-4) (Human herpesvirus 4)
Description:
ChEMBL_43071
Residue:
605
  
Inhibitor
Name:
BDBM50075148
Synonyms:
(E)-N-[(S)-1-(5-Methyl-4-oxo-4H-thieno[2,3-d][1,3]oxazin-2-yl)-ethyl]-3-(1-methyl-1H-pyrrol-2-yl)-acrylamide | CHEMBL138479
Type:
Small organic molecule
Emp. Form.:
C17H17N3O3S
Mol. Mass.:
343.4
SMILES:
C[C@H](NC(=O)\C=C\c1cccn1C)c1nc2scc(C)c2c(=O)o1
: